Hello Guest, if you reading this it means you have not yet registered. Please take a second to Click here to register and in a few simple steps, you will be able to enjoy all the many features of our fine community. Please note that nicknames are prohibited lewd or meaningless (no numbers or letters at random) and introduce yourself in the section for you to meet our community.
Problem z kompilacją kernela 2.6.1
Strona 1 z 2 12 OstatniOstatni
Pokaż wyniki od 1 do 10 z 13

Temat: Problem z kompilacją kernela 2.6.1

  1. #1
    Avatar Yoghurt
    Yoghurt jest nieaktywny Sprzedawca Żywopłotów
    Mężczyzna
    Dystrybucja: mandrake 10.1
    Dołączył
    Oct 2003
    Skąd
    WaWa
    Postów
    115
    Wątków
    9
    Siła Reputacji
    31
    Reputacja
    1

    Problem z kompilacją kernela 2.6.1

    Witam

    Otóż mam problem z kompilacją kernela wersja 2.6.1

    przy próbie instalacji po wpisaniu make meniu config pojawia się:
    Kod:
    [root@Jacek linux-2.6.1]# make menuconfig
    
    make[1]: `scripts/fixdep' jest aktualne.
    
     HOSTCC scripts/lxdialog/checklist.o
    
    In file included from scripts/lxdialog/checklist.c:24:
    
    scripts/lxdialog/dialog.h:29:20: curses.h: No such file or directory
    
    In file included from scripts/lxdialog/checklist.c:24:
    
    scripts/lxdialog/dialog.h:127: parse error before "use_colors"
    
    scripts/lxdialog/dialog.h:127: warning: type defaults to `int' in declaration of `use_colors'
    
    scripts/lxdialog/dialog.h:127: warning: data definition has no type or storage class
    
    scripts/lxdialog/dialog.h:128: parse error before "use_shadow"
    
    scripts/lxdialog/dialog.h:128: warning: type defaults to `int' in declaration of `use_shadow'
    
    scripts/lxdialog/dialog.h:128: warning: data definition has no type or storage class
    
    scripts/lxdialog/dialog.h:130: parse error before "attributes"
    
    scripts/lxdialog/dialog.h:130: warning: type defaults to `int' in declaration of `attributes'
    
    scripts/lxdialog/dialog.h:130: warning: data definition has no type or storage class
    
    scripts/lxdialog/dialog.h:143: parse error before '*' token
    
    scripts/lxdialog/dialog.h:143: warning: function declaration isn't a prototype
    
    scripts/lxdialog/dialog.h:146: parse error before '*' token
    
    scripts/lxdialog/dialog.h:146: warning: function declaration isn't a prototype
    
    scripts/lxdialog/dialog.h:147: parse error before '*' token
    
    scripts/lxdialog/dialog.h:147: warning: function declaration isn't a prototype
    
    scripts/lxdialog/dialog.h:148: parse error before '*' token
    
    scripts/lxdialog/dialog.h:149: warning: function declaration isn't a prototype
    
    scripts/lxdialog/dialog.h:150: parse error before '*' token
    
    scripts/lxdialog/dialog.h:150: warning: function declaration isn't a prototype
    
    scripts/lxdialog/checklist.c:32: parse error before '*' token
    
    scripts/lxdialog/checklist.c:34: warning: function declaration isn't a prototypescripts/lxdialog/checklist.c: In function `print_item':
    
    scripts/lxdialog/checklist.c:38: warning: implicit declaration of function `wattrset'
    
    scripts/lxdialog/checklist.c:38: `win' undeclared (first use in this function)
    
    scripts/lxdialog/checklist.c:38: (Each undeclared identifier is reported only once
    
    scripts/lxdialog/checklist.c:38: for each function it appears in.)
    
    scripts/lxdialog/checklist.c:39: warning: implicit declaration of function `wmove'
    
    scripts/lxdialog/checklist.c:39: `choice' undeclared (first use in this function)
    
    scripts/lxdialog/checklist.c:41: warning: implicit declaration of function `waddch'
    
    scripts/lxdialog/checklist.c:44: `selected' undeclared (first use in this function)
    
    scripts/lxdialog/checklist.c:46: warning: implicit declaration of function `wprintw'
    
    scripts/lxdialog/checklist.c:46: `status' undeclared (first use in this function)
    
    scripts/lxdialog/checklist.c:51: warning: implicit declaration of function `mvwaddch'
    
    scripts/lxdialog/checklist.c:51: `item' undeclared (first use in this function)
    
    scripts/lxdialog/checklist.c:53: warning: implicit declaration of function `waddstr'
    
    scripts/lxdialog/checklist.c:56: warning: implicit declaration of function `wrefresh'
    
    scripts/lxdialog/checklist.c: At top level:
    
    scripts/lxdialog/checklist.c:64: parse error before '*' token
    
    scripts/lxdialog/checklist.c:66: warning: function declaration isn't a prototypescripts/lxdialog/checklist.c: In function `print_arrows':
    
    scripts/lxdialog/checklist.c:67: `win' undeclared (first use in this function)
    
    scripts/lxdialog/checklist.c:67: `y' undeclared (first use in this function)
    
    scripts/lxdialog/checklist.c:67: `x' undeclared (first use in this function)
    
    scripts/lxdialog/checklist.c:69: `scroll' undeclared (first use in this function)
    
    scripts/lxdialog/checklist.c:82: `height' undeclared (first use in this function)
    
    scripts/lxdialog/checklist.c:85: `item_no' undeclared (first use in this function)
    
    scripts/lxdialog/checklist.c:85: `choice' undeclared (first use in this function)
    
    scripts/lxdialog/checklist.c: At top level:
    
    scripts/lxdialog/checklist.c:103: parse error before '*' token
    
    scripts/lxdialog/checklist.c:104: warning: function declaration isn't a prototype
    
    scripts/lxdialog/checklist.c: In function `print_buttons':
    
    scripts/lxdialog/checklist.c:105: `width' undeclared (first use in this function)
    
    scripts/lxdialog/checklist.c:106: `height' undeclared (first use in this function)
    
    scripts/lxdialog/checklist.c:108: `dialog' undeclared (first use in this function)
    
    scripts/lxdialog/checklist.c:108: `selected' undeclared (first use in this function)
    
    scripts/lxdialog/checklist.c: In function `dialog_checklist':
    
    scripts/lxdialog/checklist.c:126: `WINDOW' undeclared (first use in this function)
    
    scripts/lxdialog/checklist.c:126: `dialog' undeclared (first use in this function)
    
    scripts/lxdialog/checklist.c:126: `list' undeclared (first use in this function)scripts/lxdialog/checklist.c:126: warning: left-hand operand of comma expression has no effect
    
    scripts/lxdialog/checklist.c:132: warning: implicit declaration of function `endwin'
    
    scripts/lxdialog/checklist.c:133: warning: implicit declaration of function `fprintf'
    
    scripts/lxdialog/checklist.c:133: `stderr' undeclared (first use in this function)
    
    scripts/lxdialog/checklist.c:148: `COLS' undeclared (first use in this function)scripts/lxdialog/checklist.c:149: `LINES' undeclared (first use in this function)
    
    scripts/lxdialog/checklist.c:151: `stdscr' undeclared (first use in this function)
    
    scripts/lxdialog/checklist.c:153: warning: implicit declaration of function `newwin'
    
    scripts/lxdialog/checklist.c:154: warning: implicit declaration of function `keypad'
    
    scripts/lxdialog/checklist.c:154: `TRUE' undeclared (first use in this function)scripts/lxdialog/checklist.c:187: warning: implicit declaration of function `subwin'
    
    scripts/lxdialog/checklist.c:219: warning: implicit declaration of function `wnoutrefresh'
    
    scripts/lxdialog/checklist.c:221: warning: implicit declaration of function `doupdate'
    
    scripts/lxdialog/checklist.c:224: warning: implicit declaration of function `wgetch'
    
    scripts/lxdialog/checklist.c:231: `KEY_UP' undeclared (first use in this function)
    
    scripts/lxdialog/checklist.c:231: `KEY_DOWN' undeclared (first use in this function)
    
    scripts/lxdialog/checklist.c:241: `FALSE' undeclared (first use in this function)
    
    scripts/lxdialog/checklist.c:242: warning: implicit declaration of function `scrollok'
    
    scripts/lxdialog/checklist.c:243: warning: implicit declaration of function `wscrl'
    
    scripts/lxdialog/checklist.c:270: called object is not a function
    
    scripts/lxdialog/checklist.c:305: warning: implicit declaration of function `delwin'
    
    scripts/lxdialog/checklist.c:309: `KEY_LEFT' undeclared (first use in this function)
    
    scripts/lxdialog/checklist.c:310: `KEY_RIGHT' undeclared (first use in this function)
    
    /usr/include/bits/string2.h: At top level:
    
    scripts/lxdialog/dialog.h:130: warning: array `attributes' assumed to have one element
    
    make[2]: *** [scripts/lxdialog/checklist.o] Błąd 1
    
    make[1]: *** [menuconfig] Błąd 2
    
    make: *** [menuconfig] Błąd 2
    Mam mandrake'a 9.1

    PS: To moja pierwsza kompilacja na mdk i jadra serii 2.6.x Wcześniej używałem suse

    Pozdrawiam

    Yoghurt
    "Nobody will ever need more than 640k RAM!" -- Bill Gates, 1981
    "Windows 95 needs at least 8 MB RAM." -- Bill Gates, 1996
    "Nobody will ever need Windows" -- logical conclusion

  2. Panna Google
    Panna Google jest aktywna
    Avatar Panny Google

    Dołączył
    01-05-2004
    Skąd
    Internet
    Postów
    999
    Pochwał
    159

    Nie lubisz reklam? Zarejestrowani ich nie widzą! Rejestracja







  3. #2
    Dołączył
    Oct 2003
    Skąd
    Wrocław
    Wiek
    35
    Postów
    2,467
    Wątków
    38
    Siła Reputacji
    69
    Reputacja
    517

    Re: Problem z kompilacją kernela 2.6.1

    Witam

    Otóż mam problem z kompilacją kernela wersja 2.6.1

    przy próbie instalacji po wpisaniu make meniu config pojawia się:
    [code]
    [root@Jacek linux-2.6.1]# make menuconfig
    make[1]: `scripts/fixdep' jest aktualne.
    HOSTCC scripts/lxdialog/checklist.o
    In file included from scripts/lxdialog/checklist.c:24:
    scripts/lxdialog/dialog.h:29:20: curses.h: No such file or directory
    In file included from scripts/lxdialog/checklist.c:24:
    Tutaj leży prawdopodobnie błąd. Potrzebna jest Ci biblioteka ncurses. bez tego ani rusz z menuconfig. Mozesz za to spróbować make xconfig

  4. #3
    Avatar Yoghurt
    Yoghurt jest nieaktywny Sprzedawca Żywopłotów
    Mężczyzna
    Dystrybucja: mandrake 10.1
    Dołączył
    Oct 2003
    Skąd
    WaWa
    Postów
    115
    Wątków
    9
    Siła Reputacji
    31
    Reputacja
    1

    jedno głupie pytanie?

    To w takim razie mam jeszcze jedno głupie pytanie skąd ją wziąć



    Jacek
    "Nobody will ever need more than 640k RAM!" -- Bill Gates, 1981
    "Windows 95 needs at least 8 MB RAM." -- Bill Gates, 1996
    "Nobody will ever need Windows" -- logical conclusion

  5. #4
    Dołączył
    Oct 2003
    Skąd
    Wrocław
    Wiek
    35
    Postów
    2,467
    Wątków
    38
    Siła Reputacji
    69
    Reputacja
    517

    Re: jedno głupie pytanie?

    To w takim razie mam jeszcze jedno głupie pytanie skąd ją wziąć
    urpmi ncurses

  6. #5
    Avatar Yoghurt
    Yoghurt jest nieaktywny Sprzedawca Żywopłotów
    Mężczyzna
    Dystrybucja: mandrake 10.1
    Dołączył
    Oct 2003
    Skąd
    WaWa
    Postów
    115
    Wątków
    9
    Siła Reputacji
    31
    Reputacja
    1

    hmm ncurses

    Chyba jeednak nie w tym problem bo ta biblioteka jest jak się okazało już zainstalowana:
    Kod:
    [root@Jacek jacek]# urpmi.addmedia --update ncurses ftp://ftp.cesnet.cz/OS/Linux/Mandrake/mandrake/updates/9.1/RPMS/ with ../base/hdlist.cz
    
    nośnik "ncurses" już istnieje
    Co robić dalej Jakieś pomysły
    Ja naprawdę chce mieć nowe jajko

    Yoghurt
    "Nobody will ever need more than 640k RAM!" -- Bill Gates, 1981
    "Windows 95 needs at least 8 MB RAM." -- Bill Gates, 1996
    "Nobody will ever need Windows" -- logical conclusion

  7. #6
    Avatar Borry
    Borry jest nieaktywny Gold Member
    Dystrybucja: Debian/Freesco/WinXP
    Dołączył
    Nov 2003
    Skąd
    Z mamusi i tatusia
    Postów
    1,531
    Wątków
    38
    Siła Reputacji
    33
    Reputacja
    6
    Kod:
    urpmi ncurses
    zamiast
    Kod:
    urpmi.addmedia --update ncurses
    A oto człowiek który potrafi usypiać cegły.
    --------------------
    JID : borry@chrome.pl (to NIE jest mail)

  8. #7
    Avatar Yoghurt
    Yoghurt jest nieaktywny Sprzedawca Żywopłotów
    Mężczyzna
    Dystrybucja: mandrake 10.1
    Dołączył
    Oct 2003
    Skąd
    WaWa
    Postów
    115
    Wątków
    9
    Siła Reputacji
    31
    Reputacja
    1

    nadal nic

    Pojawia się komunikat
    Kod:
    wszystko zostało już zainstalowane


    Yoghurt
    "Nobody will ever need more than 640k RAM!" -- Bill Gates, 1981
    "Windows 95 needs at least 8 MB RAM." -- Bill Gates, 1996
    "Nobody will ever need Windows" -- logical conclusion

  9. #8
    Dołączył
    Oct 2003
    Skąd
    Wrocław
    Wiek
    35
    Postów
    2,467
    Wątków
    38
    Siła Reputacji
    69
    Reputacja
    517
    A te pakiety tez masz zainstalowane: libncurses, libncurses5-devel,
    ncurses-extraterms?

  10. #9
    Avatar Yoghurt
    Yoghurt jest nieaktywny Sprzedawca Żywopłotów
    Mężczyzna
    Dystrybucja: mandrake 10.1
    Dołączył
    Oct 2003
    Skąd
    WaWa
    Postów
    115
    Wątków
    9
    Siła Reputacji
    31
    Reputacja
    1

    ok, ale...

    Brakowało mi ncurses-extraterms ale po zainstalowaniu nadal jest to samo co można zobaczyćw poście pierwszym co dalej


    Yoghurt
    "Nobody will ever need more than 640k RAM!" -- Bill Gates, 1981
    "Windows 95 needs at least 8 MB RAM." -- Bill Gates, 1996
    "Nobody will ever need Windows" -- logical conclusion

  11. #10
    Dołączył
    Dec 2003
    Skąd
    bocian przyniosl
    Postów
    127
    Wątków
    8
    Siła Reputacji
    30
    Reputacja
    1

    jadro 2.6.1 - nowosci

    Nie chce zaczynac nowego watku - pytam z ciekawosci tych, ktorzy skompilowali juz jadro 2.6.x.
    Czy istnieje cos (oprocz niewatpliwej satysfakcji), co sklanialoby do podjecia trudu kompilacji nowego jadra :?:
    Po sciagnieciu najnowszych sterow nvidii, zainstalowaly sie one bez problemu na jadrze 2.4.22, mimo, ze na poprzednich byly z tym problemy (nie tylko u mnie - jak wynika z postow). Ale czy nowe jadro przynosi jakies efekty w postaci ogolnego przyspieszenia lub innych racjonalnych powodow przemawiajacych za kompilacja :?:
    Pytam, bo kiedys kompilowalem nowe jadro i czynnosc ta porozwalala mi moje ustawienia, wiec pare dni walczylem, aby wszystko przywrocic :x

Strona 1 z 2 12 OstatniOstatni

Informacje o wątku

Users Browsing this Thread

Aktualnie 1 użytkownik(ów) przegląda ten wątek. (0 zarejestrowany(ch) oraz 1 gości)

Podobne wątki

  1. Rekompilacja Kernela - Problem
    By kru in forum Instalacja Mandriva
    Odpowiedzi: 10
    Ostatni post / autor: 24.11.2004, 18:50
  2. Problem z kompilacją DC
    By MaryGave in forum Oprogramowanie
    Odpowiedzi: 6
    Ostatni post / autor: 14.07.2004, 14:49
  3. Problem z kompilacją TOME
    By nożycoręki in forum Gry
    Odpowiedzi: 5
    Ostatni post / autor: 25.05.2004, 19:45
  4. maduły jajko 2.6.1 problem
    By Anonymous in forum Oprogramowanie
    Odpowiedzi: 3
    Ostatni post / autor: 29.01.2004, 18:42

Uprawnienia

  • Nie możesz zakładać nowych wątków
  • Nie możesz pisać wiadomości
  • Nie możesz dodawać załączników
  • Nie możesz edytować swoich postów
  •