Witaj Gościu, jeżeli to czytasz to znaczy że nie jesteś zarejestrowany/zalogowany. Kliknij by się zarejestrować. Rejestracja zajmie mniej niż 30 sekund , a dzięki temu zniknie Ci ten dymek oraz będziesz miał pełne możliwośći personalizacji forum do własnych potrzeb.
błąd przy kompilacji wine
Pokaż wyniki od 1 do 4 z 4

Temat: błąd przy kompilacji wine

  1. #1
    Dołączył
    Dec 2003
    Postów
    5
    Wątków
    3
    Downloads
    0
    Uploads
    0
    Siła Reputacji
    0
    Reputacja
    1

    błąd przy kompilacji wine

    Przy kompilacji wine po poleceniu make depend na samym koncu mam następujący błąd:
    make[2]: *** [y.tab.c] Broken pipe
    make[2]: Leaving directory `/home/zigi/Documents/wine-20031118/libs/wpp'
    make[1]: *** [wpp] Błąd 2
    make[1]: Leaving directory `/home/zigi/Documents/wine-20031118/libs'
    make: *** [libs] Błąd 2
    Już tak niewiele brakuje żeby sie zrobiło a tu znowu lipa.Nie chce instalować z rpm bo potem połowa rzeczy nie działa.Prosze o pomoc bo chce sobie pograć w CS

  2. Panna Google
    Panna Google jest aktywna
    Avatar Panny Google

    Dołączył
    01-05-2004
    Skąd
    Internet
    Postów
    999
    Pochwał
    159

    Nie lubisz reklam? Zarejestrowani ich nie widzą! Rejestracja





  3. #2
    Avatar Anonymous
    Anonymous Gość

    instalacja wine -> broken pipe

    ten sam problem: podczas kompilacji kodu zrodlowego, po wydaniu polecenia 'make'.
    tlumaczac bezposrednio to : 'zlamana pipa' czyli jakas rura ale ten zlamus blokuje kompilacje Wine...
    pomocy .
    Pozdrawiam
    Marek

  4. #3
    Dołączył
    Dec 2003
    Skąd
    bocian przyniosl
    Postów
    127
    Wątków
    8
    Downloads
    0
    Uploads
    0
    Siła Reputacji
    29
    Reputacja
    1

  5. #4
    Dołączył
    Dec 2003
    Skąd
    Łomża
    Postów
    647
    Wątków
    18
    Downloads
    0
    Uploads
    0
    Siła Reputacji
    30
    Reputacja
    1
    Przeciez wine jest na plytce instalacyjnej mdk
    <img src='http://siara.moon-station.us/images/signatures/2532798644039441935ad9.gif' border='0' alt='user posted image'>

Informacje o wątku

Users Browsing this Thread

Aktualnie 1 użytkownik(ów) przegląda ten wątek. (0 zarejestrowany(ch) oraz 1 gości)

Podobne wątki

  1. Błąd Przy Kompilacji Ffmpeg
    By KozaCk in forum Oprogramowanie
    Odpowiedzi: 0
    Ostatni post / autor: 08.04.2005, 15:21
  2. Mandrake 10.1 - Błąd Przy Kompilacji Aplikacji
    By szparag in forum Oprogramowanie
    Odpowiedzi: 0
    Ostatni post / autor: 20.10.2004, 11:10
  3. Fatal Region Error Detected; Run Recovery
    By gariz in forum Oprogramowanie
    Odpowiedzi: 3
    Ostatni post / autor: 04.09.2004, 16:03
  4. Błąd gramatyczny przy drukarkach
    By e-dekoder in forum Literówki w tłumaczeniu programów
    Odpowiedzi: 3
    Ostatni post / autor: 11.06.2004, 23:11
  5. Odpowiedzi: 3
    Ostatni post / autor: 27.02.2004, 01:29

Uprawnienia

  • Nie możesz zakładać nowych wątków
  • Nie możesz pisać wiadomości
  • Nie możesz dodawać załączników
  • Nie możesz edytować swoich postów
  •